{"text_format":"1","workbook":"xlsx","n_sheets":10,"sheets":["DOCUMENTACION","Hoja1","CODIFICACION DOCUMENTOS","CODIGOS BENEFICIARIOS Y LINEAS","PREGUNTAS","DOCUMENTACION DEFINITIVA","COMBINACIONES","DOCUMENTACIÓN A TRAMITAR","DESPLEGABLES","CABECERAS"],"not_rendered":{"charts":0,"images":1,"macros":1,"external_links":0,"defined_names":29,"comments":0,"pivot_tables":0},"unopened":[],"bounds":{"document_bytes":16777216,"sheet_cells":100000,"rows_first":2000,"rows_last":500,"rows_between":2000,"halvings":0,"cell_chars":16384,"cell_head_chars":4096},"cells_cut":0,"cells_raw":0,"read":"whole","date_system":"1900"}

{"sheet":"DOCUMENTACION","index":0,"n_rows":106,"n_cols":8,"rows_kept":106,"cut":false,"hidden":false,"merged":[[105,3,105,7],[4,3,4,7],[18,3,18,7],[50,3,50,7],[28,4,28,6],[33,4,33,6],[35,4,35,6],[20,4,20,6],[22,4,22,6],[24,4,24,6],[26,4,26,6],[6,5,6,7],[8,5,8,7],[10,5,10,7],[12,5,12,7],[14,4,16,6],[74,4,74,6],[75,4,75,6],[100,4,100,6],[83,4,83,6],[84,4,84,6],[85,4,85,6],[86,4,86,6],[87,4,87,6],[88,4,88,6],[89,4,89,6],[90,4,90,6],[95,4,95,6],[96,4,96,6],[97,4,97,6],[98,4,98,6],[99,4,99,6],[65,4,65,6],[66,4,66,6],[71,4,71,6],[72,4,72,6],[73,4,73,6],[81,4,81,6],[82,4,82,6],[77,4,77,6],[78,4,78,6],[103,4,103,6],[101,4,101,6],[102,4,102,6],[91,4,91,6],[92,4,92,6],[93,4,93,6],[94,4,94,6],[58,4,58,6],[53,4,53,6],[54,4,54,6],[79,4,79,6],[80,4,80,6],[76,4,76,6],[59,4,59,6],[60,4,60,6],[61,4,61,6],[62,4,62,6],[63,4,63,6],[64,4,64,6],[67,4,67,6],[68,4,68,6],[69,4,69,6],[70,4,70,6],[2,3,2,7],[55,4,55,6],[56,4,56,6],[57,4,57,6],[30,4,30,6],[37,4,37,6]]}
[]
[]
[null,null,null,"Herramienta de ayuda para cumplimentar las solicitudes de subvención acogidas al Decreto 145/2021 de 21 de diciembre.\nLos datos obtenidos en el uso de esta herramienta tienen carácter meramente informativo, sin que en ningún caso pueda derivarse efecto jurídico vinculante alguno con esta administración."]
[]
[null,null,null,"PASO 1: Especifique en cada una de las casillas inferiores el grupo, beneficiario, opción y programa de incentivos por el cual solicita subvención."]
[]
{"$rows_left_out":101}
{"sheet":"Hoja1","index":1,"n_rows":0,"n_cols":0,"rows_kept":0,"cut":false,"hidden":true,"merged":[]}

{"sheet":"CODIFICACION DOCUMENTOS","index":2,"n_rows":69,"n_cols":7,"rows_kept":69,"cut":false,"hidden":true,"merged":[]}
[]
[]
[]
[null,null,"Articulo","Nº DOCUMENTO","Documentación general","MODALIDAD","TIPO"]
[null,null,"11.2.a",1,"Escritura de apoderamiento o documento acreditativo de representación legal, conforme el artículo 5 de la Ley 39/2015, de 1 de octubre, del Procedimiento Administrativo Común de las Administraciones Públicas (únicamente en el caso de que el poder de representante legal se haya elevado a público ante notario con anterioridad al 5 de junio de 2014 y se oponga a su consulta).","REQUIERE ANEXAR DOCUMENTO","Condicionado"]
[null,null,"11.2.b",2,"Memoria acreditativa y justificativa de los datos aportados en el apartado 6.3. de la presente solicitud","REQUIERE ANEXAR DOCUMENTO","Obligatorio"]
{"$rows_left_out":64}
{"sheet":"CODIGOS BENEFICIARIOS Y LINEAS","index":3,"n_rows":33,"n_cols":11,"rows_kept":33,"cut":false,"hidden":true,"merged":[[4,0,14,0],[15,0,18,0],[19,0,21,0],[22,0,32,0],[2,0,3,0],[2,9,3,10],[2,3,2,8],[19,1,21,1],[29,1,31,1],[24,1,25,1],[4,1,6,1],[16,1,18,1],[2,2,3,2],[2,1,3,1],[26,1,27,1]]}
[]
[]
["GRUPOS","BENEFICIARIOS","OPCIONES","PROGRAMAS DE INCENTIVOS",null,null,null,null,null,"ARTÍCULOS"]
[null,null,null,1,2,3,4,5,6]
["EMPRESA","Personas jurídicas","● SI ofrecen actividad económica o bienes (Linea 1,2,3 en función del CNAE)","1.1","2.1","3.1",null,null,null,"artículo 3-1-1.1-a"]
[null,null,"● NO ofrecen actividad económica o bienes",null,null,null,"4.1","5.1",null,"artículo 3-1-1.2-c"]
{"$rows_left_out":28}
{"sheet":"PREGUNTAS","index":4,"n_rows":47,"n_cols":19,"rows_kept":47,"cut":false,"hidden":true,"merged":[]}
[]
[]
[]
[]
[]
[]
{"$rows_left_out":42}
{"sheet":"DOCUMENTACION DEFINITIVA","index":5,"n_rows":66,"n_cols":13,"rows_kept":66,"cut":false,"hidden":true,"merged":[]}
[]
[]
[null,null,"ARTÍCULO","Nº DOCUMENTO","DOCUMENTO","MODO TRAMITACIÓN","CATEGORIA","MODALIDAD2","MODALIDAD"]
[null,{"$f":"LISTADOC[[#This Row],[CATEGORIA]]","v":{"$error":"#N/A"}},{"$f":"'DOCUMENTACIÓN A TRAMITAR'!C7","v":"11.2.b"},{"$f":"'DOCUMENTACIÓN A TRAMITAR'!D7","v":2},{"$f":"'DOCUMENTACIÓN A TRAMITAR'!E7","v":"Memoria técnica que acredite y justifique de forma adecuada, como mínimo, los datos aportados en el apartado 6.3. de la solicitud de ayuda del modelo establecido en el Anexo II del presente decreto."},{"$f":"'DOCUMENTACIÓN A TRAMITAR'!F7","v":"SI"},{"$f":"'DOCUMENTACIÓN A TRAMITAR'!G7","v":{"$error":"#N/A"}},{"$f":"'DOCUMENTACIÓN A TRAMITAR'!H7","v":"A"},{"$f":"VLOOKUP(LISTADOC[[#This Row],[MODALIDAD2]],$L$63:$M$66,2,FALSE)","v":"REQUIERE ADJUNTAR DOCUMENTO"}]
[null,{"$f":"LISTADOC[[#This Row],[CATEGORIA]]","v":{"$error":"#N/A"}},{"$f":"'DOCUMENTACIÓN A TRAMITAR'!C8","v":"11.2.c"},{"$f":"'DOCUMENTACIÓN A TRAMITAR'!D8","v":3},{"$f":"'DOCUMENTACIÓN A TRAMITAR'!E8","v":"Presupuesto de la empresa o empresas que realizarán la ejecución de las actuaciones, suficientemente desglosado por partidas y precios unitarios, de fecha posterior al 30 de junio de 2021. En el caso de que los solicitantes de las ayudas queden sujetos a normativa de contratación pública, esta documentación podrá sustituirse por el borrador de los pliegos de licitación correspondientes."},{"$f":"'DOCUMENTACIÓN A TRAMITAR'!F8","v":"SI"},{"$f":"'DOCUMENTACIÓN A TRAMITAR'!G8","v":{"$error":"#N/A"}},{"$f":"'DOCUMENTACIÓN A TRAMITAR'!H8","v":"A"},{"$f":"VLOOKUP(LISTADOC[[#This Row],[MODALIDAD2]],$L$63:$M$66,2,FALSE)","v":"REQUIERE ADJUNTAR DOCUMENTO"}]
[null,{"$f":"LISTADOC[[#This Row],[CATEGORIA]]","v":{"$error":"#N/A"}},{"$f":"'DOCUMENTACIÓN A TRAMITAR'!C11","v":"11.2.f"},{"$f":"'DOCUMENTACIÓN A TRAMITAR'!D11","v":6},{"$f":"'DOCUMENTACIÓN A TRAMITAR'!E11","v":"Declaración responsable del solicitante de hallarse al corriente en el pago de obligaciones por reintegro de subvenciones."},{"$f":"'DOCUMENTACIÓN A TRAMITAR'!F11","v":"NO (Incluido en Anexo II)"},{"$f":"'DOCUMENTACIÓN A TRAMITAR'!G11","v":{"$error":"#N/A"}},{"$f":"'DOCUMENTACIÓN A TRAMITAR'!H11","v":"B"},{"$f":"VLOOKUP(LISTADOC[[#This Row],[MODALIDAD2]],$L$63:$M$66,2,FALSE)","v":"SE RELLENA ANEXO II"}]
{"$rows_left_out":61}
{"sheet":"COMBINACIONES","index":6,"n_rows":105,"n_cols":79,"rows_kept":105,"cut":false,"hidden":true,"merged":[]}
[null,null,null,null,null,"1.1","1.2","1.3","1.4","1.5","1.6","1.7","1.8","1.9","1.10","1.11","1.12","1.13","1.14","1.15","2.1","2.2","2.3","2.4","2.5","2.6","2.7","2.8","2.9","2.10","2.11","2.12","2.13","2.14","2.15","3.1","3.2","3.3","3.4","3.5","3.6","3.7","3.8","3.9","3.10","3.11","3.12","3.13","3.14","3.15","4.1","4.2","4.3","4.4","4.5","4.6","4.7","4.8","4.9","4.10","5.1","5.2","5.3","5.4","5.5","5.6","5.7","5.8","5.9","5.10","6.1","6.2","6.3","6.4","6.5","6.6","6.7","6.8","6.9"]
[null,null,"Árticulo",null,"Documentación general"]
[]
[null,1,"11.2.a",null,"Escritura de apoderamiento o documento acreditativo de representación legal, conforme el artículo 5 de la Ley 39/2015, de 1 de octubre, del Procedimiento Administrativo Común de las Administraciones Públicas (únicamente en el caso de que el poder de representante legal se haya elevado a público ante notario con anterioridad al 5 de junio de 2014 y se oponga a su consulta).",{"$f":"PREGUNTAS!$R$35","v":{"$error":"#N/A"}},{"$f":"PREGUNTAS!$R$35","v":{"$error":"#N/A"}},{"$f":"PREGUNTAS!$R$35","v":{"$error":"#N/A"}},{"$f":"PREGUNTAS!$R$35","v":{"$error":"#N/A"}},{"$f":"PREGUNTAS!$R$35","v":{"$error":"#N/A"}},{"$f":"PREGUNTAS!$R$35","v":{"$error":"#N/A"}},{"$f":"PREGUNTAS!$R$35","v":{"$error":"#N/A"}},{"$f":"PREGUNTAS!$R$35","v":{"$error":"#N/A"}},{"$f":"PREGUNTAS!$R$35","v":{"$error":"#N/A"}},{"$f":"PREGUNTAS!$R$35","v":{"$error":"#N/A"}},"Obligatorio",{"$f":"PREGUNTAS!$R$35","v":{"$error":"#N/A"}},{"$f":"PREGUNTAS!$R$35","v":{"$error":"#N/A"}},{"$f":"PREGUNTAS!$R$35","v":{"$error":"#N/A"}},{"$f":"PREGUNTAS!$R$35","v":{"$error":"#N/A"}},{"$f":"PREGUNTAS!$R$35","v":{"$error":"#N/A"}},{"$f":"PREGUNTAS!$R$35","v":{"$error":"#N/A"}},{"$f":"PREGUNTAS!$R$35","v":{"$error":"#N/A"}},{"$f":"PREGUNTAS!$R$35","v":{"$error":"#N/A"}},{"$f":"PREGUNTAS!$R$35","v":{"$error":"#N/A"}},{"$f":"PREGUNTAS!$R$35","v":{"$error":"#N/A"}},{"$f":"PREGUNTAS!$R$35","v":{"$error":"#N/A"}},{"$f":"PREGUNTAS!$R$35","v":{"$error":"#N/A"}},{"$f":"PREGUNTAS!$R$35","v":{"$error":"#N/A"}},{"$f":"PREGUNTAS!$R$35","v":{"$error":"#N/A"}},"Obligatorio",{"$f":"PREGUNTAS!$R$35","v":{"$error":"#N/A"}},{"$f":"PREGUNTAS!$R$35","v":{"$error":"#N/A"}},{"$f":"PREGUNTAS!$R$35","v":{"$error":"#N/A"}},{"$f":"PREGUNTAS!$R$35","v":{"$error":"#N/A"}},{"$f":"PREGUNTAS!$R$35","v":{"$error":"#N/A"}},{"$f":"PREGUNTAS!$R$35","v":{"$error":"#N/A"}},{"$f":"PREGUNTAS!$R$35","v":{"$error":"#N/A"}},{"$f":"PREGUNTAS!$R$35","v":{"$error":"#N/A"}},{"$f":"PREGUNTAS!$R$35","v":{"$error":"#N/A"}},{"$f":"PREGUNTAS!$R$35","v":{"$error":"#N/A"}},{"$f":"PREGUNTAS!$R$35","v":{"$error":"#N/A"}},{"$f":"PREGUNTAS!$R$35","v":{"$error":"#N/A"}},{"$f":"PREGUNTAS!$R$35","v":{"$error":"#N/A"}},{"$f":"PREGUNTAS!$R$35","v":{"$error":"#N/A"}},"Obligatorio",{"$f":"PREGUNTAS!$R$35","v":{"$error":"#N/A"}},{"$f":"PREGUNTAS!$R$35","v":{"$error":"#N/A"}},{"$f":"PREGUNTAS!$R$35","v":{"$error":"#N/A"}},{"$f":"PREGUNTAS!$R$35","v":{"$error":"#N/A"}},{"$f":"PREGUNTAS!$R$35","v":{"$error":"#N/A"}},{"$f":"PREGUNTAS!$R$35","v":{"$error":"#N/A"}},"Obligatorio",{"$f":"PREGUNTAS!$R$35","v":{"$error":"#N/A"}},{"$f":"PREGUNTAS!$R$35","v":{"$error":"#N/A"}},{"$f":"PREGUNTAS!$R$35","v":{"$error":"#N/A"}},{"$f":"PREGUNTAS!$R$35","v":{"$error":"#N/A"}},{"$f":"PREGUNTAS!$R$35","v":{"$error":"#N/A"}},{"$f":"PREGUNTAS!$R$35","v":{"$error":"#N/A"}},{"$f":"PREGUNTAS!$R$35","v":{"$error":"#N/A"}},{"$f":"PREGUNTAS!$R$35","v":{"$error":"#N/A"}},{"$f":"PREGUNTAS!$R$35","v":{"$error":"#N/A"}},"Obligatorio",{"$f":"PREGUNTAS!$R$35","v":{"$error":"#N/A"}},{"$f":"PREGUNTAS!$R$35","v":{"$error":"#N/A"}},{"$f":"PREGUNTAS!$R$35","v":{"$error":"#N/A"}},{"$f":"PREGUNTAS!$R$35","v":{"$error":"#N/A"}},{"$f":"PREGUNTAS!$R$35","v":{"$error":"#N/A"}},{"$f":"PREGUNTAS!$R$35","v":{"$error":"#N/A"}},{"$f":"PREGUNTAS!$R$35","v":{"$error":"#N/A"}},{"$f":"PREGUNTAS!$R$35","v":{"$error":"#N/A"}},{"$f":"PREGUNTAS!$R$35","v":{"$error":"#N/A"}},"Obligatorio",{"$f":"PREGUNTAS!$R$35","v":{"$error":"#N/A"}},{"$f":"PREGUNTAS!$R$35","v":{"$error":"#N/A"}},{"$f":"PREGUNTAS!$R$35","v":{"$error":"#N/A"}},{"$f":"PREGUNTAS!$R$35","v":{"$error":"#N/A"}},{"$f":"PREGUNTAS!$R$35","v":{"$error":"#N/A"}},{"$f":"PREGUNTAS!$R$35","v":{"$error":"#N/A"}}]
[null,2,"11.2.b",null,"Memoria acreditativa y justificativa de los datos aportados en el apartado 6.3. de la presente solicitud","Obligatorio","Obligatorio","Obligatorio","Obligatorio","Obligatorio","Obligatorio","Obligatorio","Obligatorio","Obligatorio","Obligatorio","Obligatorio","Obligatorio","Obligatorio","Obligatorio","Obligatorio","Obligatorio","Obligatorio","Obligatorio","Obligatorio","Obligatorio","Obligatorio","Obligatorio","Obligatorio","Obligatorio","Obligatorio","Obligatorio","Obligatorio","Obligatorio","Obligatorio","Obligatorio","Obligatorio","Obligatorio","Obligatorio","Obligatorio","Obligatorio","Obligatorio","Obligatorio","Obligatorio","Obligatorio","Obligatorio","Obligatorio","Obligatorio","Obligatorio","Obligatorio","Obligatorio","Obligatorio","Obligatorio","Obligatorio","Obligatorio","Obligatorio","Obligatorio","Obligatorio","Obligatorio","Obligatorio","Obligatorio","Obligatorio","Obligatorio","Obligatorio","Obligatorio","Obligatorio","Obligatorio","Obligatorio","Obligatorio","Obligatorio","Obligatorio","Obligatorio","Obligatorio","Obligatorio","Obligatorio","Obligatorio","Obligatorio","Obligatorio","Obligatorio","Obligatorio"]
[null,3,"11.2.c",null,"Presupuesto de la empresa o empresas que realizarán la ejecución de las actuaciones, suficientemente desglosado.","Obligatorio","Obligatorio","Obligatorio","Obligatorio","Obligatorio","Obligatorio","Obligatorio","Obligatorio","Obligatorio","Obligatorio","Obligatorio","Obligatorio","Obligatorio","Obligatorio","Obligatorio","Obligatorio","Obligatorio","Obligatorio","Obligatorio","Obligatorio","Obligatorio","Obligatorio","Obligatorio","Obligatorio","Obligatorio","Obligatorio","Obligatorio","Obligatorio","Obligatorio","Obligatorio","Obligatorio","Obligatorio","Obligatorio","Obligatorio","Obligatorio","Obligatorio","Obligatorio","Obligatorio","Obligatorio","Obligatorio","Obligatorio","Obligatorio","Obligatorio","Obligatorio","Obligatorio","Obligatorio","Obligatorio","Obligatorio","Obligatorio","Obligatorio","Obligatorio","Obligatorio","Obligatorio","Obligatorio","Obligatorio","Obligatorio","Obligatorio","Obligatorio","Obligatorio","Obligatorio","Obligatorio","Obligatorio","Obligatorio","Obligatorio","Obligatorio","Obligatorio","Obligatorio","Obligatorio","Obligatorio","Obligatorio","Obligatorio","Obligatorio","Obligatorio","Obligatorio"]
{"$rows_left_out":100}
{"sheet":"DOCUMENTACIÓN A TRAMITAR","index":7,"n_rows":79,"n_cols":8,"rows_kept":79,"cut":false,"hidden":true,"merged":[[2,3,2,4],[70,1,70,2]]}
[]
[]
["GRUPO","BENEFICIARIO","OPCIONES","Nº DOCUMENTO",null,"REQUIRE DOCUMENTO FISICO","CODIGO DE BENEFICIARIO Y LINEA"]
[{"$f":"VLOOKUP(G4,CABECERAS!A2:E91,2,FALSE)","v":{"$error":"#N/A"}},{"$f":"VLOOKUP(G4,CABECERAS!A2:E86,3,FALSE)","v":{"$error":"#N/A"}},{"$f":"VLOOKUP(G4,CABECERAS!A2:E91,4,FALSE)","v":{"$error":"#N/A"}},{"$f":"VLOOKUP(G4,CABECERAS!A2:E91,5,FALSE)","v":{"$error":"#N/A"}},{"$f":"VLOOKUP(G4,CABECERAS!A2:E91,5,FALSE)","v":{"$error":"#N/A"}},null,{"$f":"DESPLEGABLES!AG2","v":{"$error":"#N/A"}}]
["CONFIRMACIÓN / ","COMENTARIOS","Articulo","Nº DOCUMENTO","Documentación general","MODALIDAD","CATEGORIA","MODALIDAD"]
[null,null,"11.2.a",1,"Escritura de apoderamiento o documento acreditativo de representación legal, conforme el artículo 5 de la Ley 39/2015, de 1 de octubre, del Procedimiento Administrativo Común de las Administraciones Públicas, únicamente en el caso de que el poder de representante legal se haya elevado a público ante notario con anterioridad al 5 de junio de 2014, o para fechas posteriores caso de que se oponga a su consulta.","SI",{"$f":"HLOOKUP($G$4,COMBINACIONES!$F$1:$CA$103,4,FALSE)","v":{"$error":"#N/A"}},"A"]
{"$rows_left_out":74}
{"sheet":"DESPLEGABLES","index":8,"n_rows":94,"n_cols":47,"rows_kept":94,"cut":false,"hidden":true,"merged":[]}
["CODIGO","GRUPO",null,"BENEFICIARIO",null,"OPCIONES",null,"LINEA",null,"concatenacion","CODIGO","INDICADO",null,null,null,null,null,null,null,null,null,null,null,null,null,null,null,null,null,null,null,"concatenar",null,null,null,"GRUPO","nº","BENEFICIARIO","nº","OPCIONES","nº","LINEA","nº",null,null,"CODIGO"]
["1.1","EMPRESAS",{"$f":"VLOOKUP(B2,$AJ$2:$AK$5,2,FALSE)","v":2},"Personas_juridicas",{"$f":"VLOOKUP(D2,$AL$2:$AM$20,2,FALSE)","v":11},"SI_ofrecen_actividad_economica_o_bienes",{"$f":"VLOOKUP(F2,$AN$2:$AO6,2,FALSE)","v":89},1,{"$f":"VLOOKUP(H2,$AP$2:$AQ$7,2,FALSE)","v":109},{"$f":"I2*G2*E2*C2","v":213422},"1.1","Seleccionar",null,null,null,{"$f":"VLOOKUP(L2,AJ2:AK5,2,FALSE)","v":{"$error":"#N/A"}},"Seleccionar",null,null,null,{"$f":"VLOOKUP(Q2,AL2:AM20,2,FALSE)","v":{"$error":"#N/A"}},"Seleccionar",null,null,null,{"$f":"VLOOKUP(V2,AN2:AO6,2,FALSE)","v":{"$error":"#N/A"}},"Seleccionar",null,null,null,{"$f":"VLOOKUP(AA2,AP2:AQ7,2,FALSE)","v":{"$error":"#N/A"}},{"$f":"AE2*Z2*U2*P2","v":{"$error":"#N/A"}},{"$f":"VLOOKUP(AF2,J2:K91,2,FALSE)","v":{"$error":"#N/A"}},null,null,"EMPRESAS",2,"Personas_juridicas",11,"SI_ofrecen_actividad_economica_o_bienes",89,1,109,null,null,"1.1","SELECCIÓN CORRECTA"]
["1.2","EMPRESAS",{"$f":"VLOOKUP(B3,$AJ$2:$AK$5,2,FALSE)","v":2},"Agrupaciones_de_empresa",{"$f":"VLOOKUP(D3,$AL$2:$AM$20,2,FALSE)","v":13},"SI_ofrecen_actividad_economica_o_bienes",{"$f":"VLOOKUP(F3,$AN$2:$AO7,2,FALSE)","v":89},1,{"$f":"VLOOKUP(H3,$AP$2:$AQ$7,2,FALSE)","v":109},{"$f":"I3*G3*E3*C3","v":252226},"1.2",null,null,null,null,null,null,null,null,null,null,null,null,null,null,null,null,null,null,null,null,null,null,null,null,"ADMINISTRACIÓN",3,"Agrupaciones_de_empresa",13,"NO_ofrecen_actividad_economica_o_bienes",97,2,113,null,null,"1.2","SELECCIÓN CORRECTA"]
["1.3","EMPRESAS",2,"Agrupaciones_de_personas_fisicas_con_o_sin_personalidad_jurídica",17,"SI_ofrecen_actividad_economica_o_bienes",{"$f":"VLOOKUP(F4,$AN$2:$AO8,2,FALSE)","v":89},1,109,329834,"1.3",null,null,null,null,null,null,null,null,null,null,null,null,null,null,null,null,null,null,null,null,null,null,null,null,"SECTOR_INSTITUCIONAL",5,"Agrupaciones_de_personas_fisicas_con_o_sin_personalidad_jurídica",17,"NO_ofrecen_actividad_economica_o_bienes_+_Actuación_en_vivienda_de_titularidad_pública",101,3,127,null,null,"1.3","SELECCIÓN CORRECTA"]
["1.4","EMPRESAS",2,"Gestores_de_poligonos_publicos_o_privados",19,"Ninguna",{"$f":"VLOOKUP(F5,$AN$2:$AO9,2,FALSE)","v":103},1,109,426626,"1.4",null,null,null,null,null,null,null,null,null,null,null,null,null,null,null,null,null,null,null,null,null,null,null,null,"RESTO_BENEFICIARIOS",7,"Gestores_de_poligonos_publicos_o_privados",19,"Ninguna",103,4,131,null,null,"1.4","SELECCIÓN CORRECTA"]
["1.5","EMPRESAS",2,"Empresas_explotadoras",23,"Ninguna",{"$f":"VLOOKUP(F6,$AN$2:$AO10,2,FALSE)","v":103},1,109,516442,"1.5",null,null,null,null,null,null,null,null,null,null,null,null,null,null,null,null,null,null,null,null,null,null,null,null,null,null,"Empresas_explotadoras",23,"Excluida_ayuda_de_estado",107,5,137,null,null,"1.5","SELECCIÓN CORRECTA"]
{"$rows_left_out":89}
{"sheet":"CABECERAS","index":9,"n_rows":91,"n_cols":8,"rows_kept":91,"cut":false,"hidden":true,"merged":[]}
["CODIGO","GRUPO","BENEFICIARIO","OPCIONES","PROGRAMA DE INCENTIVOS"]
["1.1","EMPRESAS","Personas juridicas","SI ofrecen actividad economica o bienes","Programa de incentivos 1: Realización de instalaciones de autoconsumo, con fuentes de energía renovable, en el sector servicios, con o sin almacenamiento."]
["1.2","EMPRESAS","Agrupaciones de empresa","SI ofrecen actividad economica o bienes","Programa de incentivos 1: Realización de instalaciones de autoconsumo, con fuentes de energía renovable, en el sector servicios, con o sin almacenamiento."]
["1.3","EMPRESAS","Agrupaciones de personas fisicas con o sin personalidad jurídica (comunidad de bienes)","SI ofrecen actividad economica o bienes","Programa de incentivos 1: Realización de instalaciones de autoconsumo, con fuentes de energía renovable, en el sector servicios, con o sin almacenamiento."]
["1.4","EMPRESAS","Gestores de poligonos publicos o privados","Ninguna","Programa de incentivos 1: Realización de instalaciones de autoconsumo, con fuentes de energía renovable, en el sector servicios, con o sin almacenamiento."]
["1.5","EMPRESAS","Empresas explotadoras","Ninguna","Programa de incentivos 1: Realización de instalaciones de autoconsumo, con fuentes de energía renovable, en el sector servicios, con o sin almacenamiento."]
{"$rows_left_out":85}