{"text_format":"1","workbook":"xlsx","n_sheets":6,"sheets":["Introduccion de datos","Listado CNAE-2009","Auxiliar","PI 1-2-3","PI 4-5","PI 6"],"not_rendered":{"charts":0,"images":1,"macros":1,"external_links":0,"defined_names":2,"comments":1,"pivot_tables":0},"unopened":[],"bounds":{"document_bytes":16777216,"sheet_cells":100000,"rows_first":2000,"rows_last":500,"rows_between":2000,"halvings":0,"cell_chars":16384,"cell_head_chars":4096},"cells_cut":0,"cells_raw":0,"read":"whole","date_system":"1900"}

{"sheet":"Introduccion de datos","index":0,"n_rows":71,"n_cols":4,"rows_kept":71,"cut":false,"hidden":false,"merged":[[59,1,59,2],[68,1,68,3],[8,1,8,3],[11,1,11,2],[20,1,20,2],[23,3,24,3],[33,1,33,3],[39,1,39,2],[53,1,53,3],[51,3,52,3]]}
[]
[]
[]
[]
[]
[]
[]
[]
[null,"Herramienta de ayuda para cumplimentar las solicitudes de subvención acogidas al Decreto 145/2021 de 21 de diciembre.\nLos datos obtenidos en el uso de esta herramienta tienen carácter meramente informativo, sin que en ningún caso pueda derivarse efecto jurídico vinculante alguno con esta administración."]
[]
[null,null,"Introducir o seleccionar datos solamente en las celdas amarillas"]
[null,"DATOS DE ENTRADA",null,"Observaciones"]
[null,"Tipo de instalación para la que solicita la ayuda",null,"Elegir opción"]
[null,"Tipo de solicitante",null,{"$f":"IF(C14=\"\",\"Elegir opción\",VLOOKUP(C14,Auxiliar!R32:S56,2,FALSE))","v":"Elegir opción"}]
[null,"¿Realiza actividad económica?",null,{"$f":"IF(OR(C14=Auxiliar!R23,C14=Auxiliar!R26),\"No aplicable\",\"Elegir opción\")","v":"Elegir opción"}]
{"$rows_left_out":57}
{"sheet":"Listado CNAE-2009","index":1,"n_rows":1011,"n_cols":3,"rows_kept":1011,"cut":false,"hidden":false,"merged":[]}
["COD_CNAE2009","CODINTEGR","TITULO_CNAE2009"]
["A","A","Agricultura, ganadería, silvicultura y pesca"]
[1,"A01","Agricultura, ganadería, caza y servicios relacionados con las mismas"]
[11,"A011","Cultivos no perennes"]
[111,"A0111","Cultivo de cereales (excepto arroz), leguminosas y semillas oleaginosas"]
[112,"A0112","Cultivo de arroz"]
[113,"A0113","Cultivo de hortalizas, raíces y tubérculos"]
[114,"A0114","Cultivo de caña de azúcar"]
[115,"A0115","Cultivo de tabaco"]
[116,"A0116","Cultivo de plantas para fibras textiles"]
[119,"A0119","Otros cultivos no perennes"]
[12,"A012","Cultivos perennes"]
[121,"A0121","Cultivo de la vid"]
[122,"A0122","Cultivo de frutos tropicales y subtropicales"]
[123,"A0123","Cultivo de cítricos"]
{"$rows_left_out":997}
{"sheet":"Auxiliar","index":2,"n_rows":1011,"n_cols":38,"rows_kept":1011,"cut":false,"hidden":true,"merged":[[26,21,26,24],[25,31,25,33],[18,31,18,33],[19,31,19,33],[20,31,20,33],[21,31,21,33],[23,31,23,33],[0,17,0,28],[26,31,26,33],[27,31,27,33],[11,31,11,33],[12,31,12,33],[13,31,13,33],[6,31,6,33],[7,31,7,33],[8,31,8,33],[9,31,9,33],[5,31,5,33],[0,30,0,33],[3,31,3,33],[4,31,4,33],[2,31,2,33],[24,31,24,33],[35,31,35,33],[36,31,36,33],[37,31,37,33],[38,31,38,33],[40,31,40,33],[41,5,44,5],[45,5,47,5],[43,31,43,33],[44,31,44,33],[39,31,39,33],[41,31,41,33],[42,31,42,33],[32,31,32,33],[34,31,34,33],[1,31,1,33],[10,31,10,33],[23,21,23,26],[33,31,33,33],[28,31,28,33],[29,31,29,33],[22,31,22,33],[31,31,31,33],[1,27,1,28],[30,31,30,33],[14,31,14,33],[15,31,15,33],[16,31,16,33],[17,31,17,33],[85,5,85,9],[86,5,86,9],[49,12,55,12],[62,7,62,9],[61,5,62,5],[61,6,62,6],[72,7,72,9],[82,7,82,9],[56,7,56,10],[57,5,60,5],[49,5,52,5],[4,21,7,22],[49,13,55,13],[53,5,55,5],[83,5,83,9],[84,5,84,9],[25,6,26,6],[39,6,40,6],[39,5,40,5],[40,7,40,9],[48,7,48,9],[35,5,38,5],[25,5,26,5],[34,7,34,10],[26,7,26,9],[27,5,30,5],[31,5,33,5]]}
["CP","Municipio","Población 2020","RETO DEMOGRÁFICO",null,"Situación expediente",null,null,null,"DATOS","Distribución","Desmantelamiento","Categoría\nde empresa","Efectivos","Volumen de\nnegocio","Balance general",null,"CÁLCULO DEL PROGRAMA  DE INCENTIVOS",null,null,null,null,null,null,null,null,null,null,null,null,"CHECK LIST",null,null,null,null,"COD_CNAE2009","CODINTEGR","TITULO_CNAE2009"]
[6001,"Acedera",826,"RETO  < 5.000",null,"Anulado",null,null,null,"SI","NO","NO","Grande",">250",">50.000.000 €",">43.000.000 €",null,"Lista Beneficiarios","Posible\npograma","¿Realiza actividad\neconómica?","Posible\npograma","¿En representación\nde otros?","Posible\npograma","Lista\nCNAE","Posible\nprograma","Tipo de instalación","Posible\nprograma","SUMA",null,null,null,"Presupuesto l) <4%, 3.000€",null,null,null,"A","A","Agricultura, ganadería, silvicultura y pesca"]
[6002,"Aceuchal",">5.000",">5.000",null,"C-Solicitud",null,null,null,"NO","Suelo Radiante","Solar","Mediana",250,50000000,43000000,null,"Empresa de servicios energéticos",123,"SI",123,"SI",123456,"Dato no necesario",0,"Fotovoltaica sin almacenamiento",124,{"$f":"S3+U3+Y10+AA3","v":383},1,null,null,"Presupuesto l)+m)+n) <7%, 7.000€",null,null,null,1,"A01","Agricultura, ganadería, caza y servicios relacionados con las mismas"]
[6003,"Ahillones",863,"RETO  < 5.000",null,"C-Subsanación",null,null,null,null,"Radiadores","Biomasa","Pequeña",50,10000000,10000000,null,"Proveedor de servicios energéticos",123,"NO",456,"NO",23456,"A01 (excepto A17)",23,"Eólica sin almacenamiento",124,{"$f":"S9+U3+Y10+AA3","v":123717},1,null,null,"RESIDUOS",null,null,null,11,"A011","Cultivos no perennes"]
[6004,"Alange",1856,"RETO  < 5.000",null,"C-Completo",null,null,null,null,"Sector",null,null,null,null,null,null,"Empresa explotadora/arrendataria/concesionaria",123,null,null,"SOLO PARA:\n-Administración\n-Sector Industrial",null,"B",23,"Fotovoltaica con almacenamiento",124,{"$f":"S10+U3+W3+Y10+AA3","v":247172},1,null,null,"GASTOS NO SUBVENCIONABLES (Art. 7)",null,null,null,111,"A0111","Cultivo de cereales (excepto arroz), leguminosas y semillas oleaginosas"]
[6005,"La Albuera",2035,"RETO  < 5.000",null,"C-Prop. Prov. Concesión",null,null,null,null,"Sector Residencial",null,null,null,null,null,null,"Gestor de polígono industriales",123,null,null,null,null,"C",23,"Eólica con almacenamiento",124,{"$f":"S24+U3+Y10+AA3","v":12605},1,null,null,"Documentación general",null,null,null,112,"A0112","Cultivo de arroz"]
[6006,"Alburquerque",">5.000",">5.000",null,"C-Prop. Prov. Denegación",null,null,null,null,"Administraciones públicas",null,null,null,null,null,null,"Agrupación personas físicas",123,null,null,null,null,"D",23,"Incorporación de almacenamiento",35,{"$f":"S3+U3+Y4+AA3","v":393},2,null,null,"Escritura de apoderamiento.",null,null,null,113,"A0113","Cultivo de hortalizas, raíces y tubérculos"]
[6007,"Alconchel",1659,"RETO  < 5.000",null,"C-Prop. Def. Concesión",null,null,null,null,"Tercer sector (ONG)",null,null,null,null,null,null,"Agrupación de empresas",123,null,null,null,null,"E",23,"Aerotermia aire-agua (Climatización y/o ACS)",6,{"$f":"S9+U3+Y4+AA3","v":123727},2,null,null,"Memoria técnica.",null,null,null,114,"A0114","Cultivo de caña de azúcar"]
[6008,"Alconera",743,"RETO  < 5.000",null,"C-Resol. Concesión",null,null,null,null,"Otro sector (agropecuario, etc)",null,null,null,null,null,null,"Otros tipos de empresas (personas jurídicas)",123457,6,null,null,null,"F",23,"Solar Térmica",6,{"$f":"S10+U3+W3+Y4+AA3","v":247182},2,null,null,"Presupuesto de la empresa.",null,null,null,115,"A0115","Cultivo de tabaco"]
[6009,"Aljucén",250,"RETO  < 5.000",null,"C-Resol. Inadmisión",null,null,null,null,null,null,null,null,null,null,null,"Municipio o Ayuntamiento",123456,null,null,null,null,"G",13,"Biomasa caldera",6,{"$f":"S10+U3+W4+Y4+AA3","v":147182},2,null,null,"DR no afectación medioambiental.",null,null,null,116,"A0116","Cultivo de plantas para fibras textiles"]
[6010,"Almendral",1239,"RETO  < 5.000",null,"C-Resol. Denegación",null,null,null,null,null,null,null,null,null,null,null,"Entidad local menor",123456,null,null,null,null,"H",13,"Biomasa aparatos de calefacción local",6,{"$f":"S24+U3+Y4+AA3","v":12615},2,null,null,"P>100KW - Plan estratégico.",null,null,null,119,"A0119","Otros cultivos no perennes"]
[6011,"Almendralejo",">5.000",">5.000",null,"C-Resol. Desistimiento",null,null,null,null,null,null,null,null,null,null,null,"Mancomunidad de municipios",123456,null,null,null,null,"I",13,"Geotermica de circuito cerrado",6,{"$f":"S27+U3+Y4+AA3","v":23728},2,null,null,"P>100KW - Justificación no causar daño medioambiental.",null,null,null,12,"A012","Cultivos perennes"]
[6012,"Arroyo de San Serván",4080,"RETO  < 5.000",null,"C-Resol. Renuncia",null,null,null,null,null,null,null,null,null,null,null,"Diputación provincial",123456,null,null,null,null,"J",13,"Geotermica o Hidrotérmica de circuito abierto",6,{"$f":"S3+U3+Y4+AA7","v":304},3,null,null,"P>100KW - Memoria resumen RESIDUOS DE CONSTRUCCIÓN LER.",null,null,null,121,"A0121","Cultivo de la vid"]
[6013,"Atalaya",294,"RETO  < 5.000",null,"L- Solicitud",null,null,null,null,null,null,null,null,null,null,null,"Otras entidades locales",123456,null,null,null,null,"K",13,null,null,{"$f":"S3+U3+Y10+AA7","v":294},3,null,null,"DR incl. SOLICITUD - Pago obligaciones por reintegro de subvenciones.",null,null,null,122,"A0122","Cultivo de frutos tropicales y subtropicales"]
[6014,"Azuaga",">5.000",">5.000",null,"L- Subsanación",null,null,null,null,null,null,null,null,null,null,null,"Organismo público o entidad de derecho público vinculados o dependientes administración Pública Local",123456,null,null,null,null,"L",13,null,null,{"$f":"S9+U3+Y4+AA7","v":123638},3,null,null,"DR incl. SOLICITUD - No ha recibido ayuda anterior para la misma actuación.",null,null,null,123,"A0123","Cultivo de cítricos"]
{"$rows_left_out":997}
{"sheet":"PI 1-2-3","index":3,"n_rows":19,"n_cols":11,"rows_kept":19,"cut":false,"hidden":true,"merged":[[10,8,10,11],[8,6,8,9],[1,1,1,4],[18,1,18,2],[3,3,5,3],[3,4,5,4],[2,1,2,4]]}
[]
[null,{"$f":"IF(OR('Introduccion de datos'!C18=1,'Introduccion de datos'!C18=2,'Introduccion de datos'!C18=3),\"PROGRAMA DE INCENTIVOS 1-2-3\",\"NO UTILIZAR ESTA HOJA PARA EL CÁLCULO\")","v":"NO UTILIZAR ESTA HOJA PARA EL CÁLCULO"}]
[null,"DATOS DE ENTRADA"]
[null,"Efectivos de la empresa (nº de personas)",{"$f":"'Introduccion de datos'!C23","v":0},"Tipo de empresa",{"$f":"IF(AND(C4<Auxiliar!N4,OR(C5<Auxiliar!O4,C6<Auxiliar!P4)),\"Pequeña\",IF(AND(C4<Auxiliar!N3,OR(C5<Auxiliar!O3,C6<Auxiliar!P3)),\"Mediana\",\"Grande\"))","v":"Pequeña"}]
[null,"Volumen de negocio (€)",{"$f":"'Introduccion de datos'!C24","v":0}]
[null,"Balance general (€)",{"$f":"'Introduccion de datos'!C25","v":0}]
[null,"¿Se retira cubierta de amianto?",{"$f":"'Introduccion de datos'!C26","v":0},"Costes eliminación de amianto (sin IVA)",{"$f":"'Introduccion de datos'!C27","v":0},null,"Csau 1 (Amianto )",{"$f":"IF(C7=\"SI\",VLOOKUP(G14,Auxiliar!$G$28:$P$34,7,FALSE),0)","v":0}]
[null,"¿Se incluye marquesina?",{"$f":"'Introduccion de datos'!C28","v":0},"Costes de la marquesina (sin IVA)",{"$f":"'Introduccion de datos'!C29","v":0},null,"Csau 2 (Marquesina)",{"$f":"IF(OR('Introduccion de datos'!C13=Auxiliar!Z3,'Introduccion de datos'!C13=Auxiliar!Z5),IF(C8=\"SI\",500,0),0)","v":0},{"$f":"IF(E4=\"Grande\",8,IF(E4=\"Mediana\",9,10))","v":10}]
[null,"Localidad",{"$f":"'Introduccion de datos'!C22","v":0},"RETO DEMOGRÁFICO",{"$f":"VLOOKUP(C9,Auxiliar!B2:D389,3,FALSE)","v":{"$error":"#N/A"}},null,{"$f":"IF(E9=\"RETO  < 5.000\",\"SI aplica ayuda adicional por Población\",\"NO aplica ayuda adicional por Población\")","v":{"$error":"#N/A"}}]
[null,"Potencia instalación de GENERACIÓN(kWp)",{"$f":"'Introduccion de datos'!C30","v":0},"Inversión en GENERACIÓN (sin IVA)",{"$f":"'Introduccion de datos'!C31","v":0},null,"Psubvencionable",{"$f":"IF('Introduccion de datos'!C18=3,0,IF(C10>5000,5000,C10))","v":0},"kW"]
[null,"Capaciad de ALMACENAMIENTO (kWh)",{"$f":"'Introduccion de datos'!C32","v":80},"Inversión en ALMACENAMIENTO (sin IVA)",{"$f":"'Introduccion de datos'!C33","v":0},null,"AVISO",{"$f":"IF(C11/C10>2,\"Error\",\"OK\")","v":{"$error":"#DIV/0!"}},{"$f":"IF(H11=\"Error\", \"Se supera el ratio de 2kWh/kW\",\"\")","v":{"$error":"#DIV/0!"}}]
[null,null,null,null,null,null,"Cem","Ceud-gen","Cuf","Csm","Ceud-alm"]
[null,"Coste elegible declarado GENERACIÓN (sin IVA)",{"$f":"E10","v":0},"Coste elegible declarado ALMACENAMIENTO (sin IVA)",{"$f":"E11","v":0},null,{"$f":"VLOOKUP(G14,Auxiliar!$G$28:$P$34,6,FALSE)","v":4723},{"$f":"IF('Introduccion de datos'!C18=3,0,C13/H10)","v":{"$error":"#DIV/0!"}},{"$f":"VLOOKUP(G14,Auxiliar!$G$28:$P$34,5,FALSE)","v":-86},{"$f":"IF(OR('Introduccion de datos'!C13=Auxiliar!Z3,'Introduccion de datos'!C13=Auxiliar!Z4),0,VLOOKUP(J14,Auxiliar!$G$36:$P$39,6,FALSE))","v":500},{"$f":"IF(J13=0,0,E13/C11)","v":0}]
[null,"Coste subvencionable unitario GEN. (€/kWp)",{"$f":"IF('Introduccion de datos'!C18=3,0,IF((H13+I13)>G13,G13,H13+I13))","v":{"$error":"#DIV/0!"}},"Coste subvencionable unitario ALMAC. (€/kWp)",{"$f":"IF(H11=\"Error\",0,MIN(J13:K13))","v":{"$error":"#DIV/0!"}},null,{"$f":"IF(OR('Introduccion de datos'!C13=Auxiliar!Z3,'Introduccion de datos'!C13=Auxiliar!Z5),IF(C10<=10,Auxiliar!G31,IF(AND(C10>10,C10<=100),Auxiliar!G30,IF(AND(C10>100,C10<=1000),Auxiliar!G29,Auxiliar!G28))),IF(C10<=20,Auxiliar!G34,IF(AND(C10>20,C10<=500),Auxiliar!G33,IF(AND(C10>500,C10<=5000),Auxiliar!G32,Auxiliar!G32))))","v":"F7"},null,null,{"$f":"IF(C11=\"\",\"\",IF(C11<=10,Auxiliar!G39,IF(AND(C11>10,C11<=100),Auxiliar!G38,IF(AND(C11>100,C11<=5000),Auxiliar!G37,Auxiliar!G36))))","v":"F10"}]
[null,"Coste subvencionable GENERACIÓN (€/kWp)",{"$f":"IF(C14*H10<C13,C14*H10,C13)","v":{"$error":"#DIV/0!"}},"Coste subvencionable ALMACENAMIENTO (€/kWp)",{"$f":"E14*C11","v":{"$error":"#DIV/0!"}}]
{"$rows_left_out":5}
{"sheet":"PI 4-5","index":4,"n_rows":16,"n_cols":12,"rows_kept":16,"cut":false,"hidden":true,"merged":[[15,1,15,2],[1,1,1,4],[8,8,8,12],[6,6,6,9],[2,1,2,4]]}
[]
[null,{"$f":"IF(OR('Introduccion de datos'!C18=4,'Introduccion de datos'!C18=5),\"PROGRAMA DE INCENTIVOS 4-5\",\"NO UTILIZAR ESTA HOJA PARA EL CÁLCULO\")","v":"NO UTILIZAR ESTA HOJA PARA EL CÁLCULO"}]
[null,"DATOS DE ENTRADA"]
[null,"¿Sector?",{"$f":"'Introduccion de datos'!C42","v":0},"¿Autoconsumo colectivo?",{"$f":"'Introduccion de datos'!C43","v":0}]
[null,"¿Se retira cubierta de amianto?",{"$f":"'Introduccion de datos'!C44","v":0},"Costes eliminación de amianto",{"$f":"'Introduccion de datos'!C45","v":0},null,"Csau 1 (Amianto )",{"$f":"IF(C5=\"SI\",VLOOKUP(G12,Auxiliar!$G$42:$N$48,7,FALSE),0)","v":0}]
[null,"¿Se incluye marquesina?",{"$f":"'Introduccion de datos'!C46","v":0},"Costes de la marquesina",{"$f":"'Introduccion de datos'!C47","v":0},null,"Csau 2 (Marquesina)",{"$f":"IF(OR('Introduccion de datos'!C13=Auxiliar!Z3,'Introduccion de datos'!C13=Auxiliar!Z5),IF(C6=\"SI\",120,0),0)","v":0},{"$f":"IF(E4=\"NO\",5,6)","v":6}]
[null,"Localidad",{"$f":"'Introduccion de datos'!C41","v":0},"RETO DEMOGRÁFICO",{"$f":"VLOOKUP(C7,Auxiliar!B2:D389,3,FALSE)","v":{"$error":"#N/A"}},null,{"$f":"IF(E7=\"RETO  < 5.000\",\"SI aplica ayuda adicional por Población\",\"NO aplica ayuda adicional por Población\")","v":{"$error":"#N/A"}}]
[null,"Potencia instalación de GENERACIÓN(kWp)",{"$f":"'Introduccion de datos'!C48","v":0},"Inversión en GENERACIÓN",{"$f":"'Introduccion de datos'!C49","v":0},null,"Psubvencionable",{"$f":"IF('Introduccion de datos'!C18=5,0,IF(C8>5000,5000,C8))","v":0},"kW"]
[null,"Capaciad de ALMACENAMIENTO (kWh)",{"$f":"'Introduccion de datos'!C50","v":0},"Inversión en ALMACENAMIENTO",{"$f":"'Introduccion de datos'!C51","v":0},null,"AVISO",{"$f":"IF(C9/C8>2,\"Error\",\"ok\")","v":{"$error":"#DIV/0!"}},{"$f":"IF(H9=\"Error\", \"Se supera el ratio de 2kWh/kWp\",\"\")","v":{"$error":"#DIV/0!"}}]
[null,null,null,null,null,null,"Mód. Gen.","Ayuda Reto","Ceud-gen","Mód. Alm","Ayuda Reto","Ceud-alm"]
[null,"Coste elegible declarado GENERACIÓN (sin IVA)",{"$f":"E8","v":0},"Coste elegible declarado ALMACENAMIENTO",{"$f":"E9","v":0},null,{"$f":"IF(C4=\"Sector Residencial\",VLOOKUP(G12,Auxiliar!$G$42:$N$48,I6,FALSE),VLOOKUP(G12,Auxiliar!$G$50:$N$56,I6,FALSE))","v":4550},{"$f":"IF(E7=\"RETO  < 5.000\",VLOOKUP(G12,Auxiliar!$G$42:$N$48,8,FALSE),0)","v":{"$error":"#N/A"}},{"$f":"IF('Introduccion de datos'!C18=5,0,C11/H8)","v":{"$error":"#DIV/0!"}},{"$f":"IF(OR('Introduccion de datos'!C13=Auxiliar!Z3,'Introduccion de datos'!C13=Auxiliar!Z4),0,VLOOKUP(J12,Auxiliar!$G$58:$N$61,6,FALSE))","v":490},{"$f":"IF(E7=\"RETO  < 5.000\",15,0)","v":{"$error":"#N/A"}},{"$f":"IF(J11=0,0,E11/C9)","v":{"$error":"#DIV/0!"}}]
[null,"Coste subvencionable unitario GEN. (€/kWp)",{"$f":"MIN(SUM(G11:H11),I11)","v":{"$error":"#N/A"}},"Coste subvencionable unitario ALMAC. (€/kWp)",{"$f":"IF(H9=\"Error\",0,MIN(SUM(J11:K11),L11))","v":{"$error":"#DIV/0!"}},null,{"$f":"IF(OR('Introduccion de datos'!C13=Auxiliar!Z3,'Introduccion de datos'!C13=Auxiliar!Z5),IF(C8<=10,Auxiliar!G45,IF(AND(C8>10,C8<=100),Auxiliar!G44,IF(AND(C8>100,C8<=1000),Auxiliar!G43,Auxiliar!G42))),IF(C8<=20,Auxiliar!G48,IF(AND(C8>20,C8<=500),Auxiliar!G47,IF(AND(C8>500,C8<=5000),Auxiliar!G46,Auxiliar!G46))))","v":"F7"},null,null,{"$f":"IF(C9=\"\",\"\",IF(C9<=10,\"F11\",IF(AND(C9>10,C9<=100),\"F10\",IF(AND(C9>100,C9<=5000),\"F9\",\"F8\"))))","v":"F11"}]
[null,"Coste subvencionable GENERACIÓN (€/kWp)",{"$f":"IF(C12*H8<C11,C12*H8,C11)","v":{"$error":"#N/A"}},"Coste subvencionable ALMACENAMIENTO (€/kWp)",{"$f":"E12*C9","v":{"$error":"#DIV/0!"}}]
[null,"Coste subvencionable ELIMINACIÓN AMIANTO",{"$f":"IF(H5*H8<E5,H5*H8,E5)","v":0},"Coste subvencionable MARQUESINA",{"$f":"IF(H6*H8<E6,H6*H8,E6)","v":0}]
[null,"Cuantía Subvención en GENERACIÓN",{"$f":"C13+C14+E14","v":{"$error":"#N/A"}},"Cuantía Subvención en ALMACENAMIENTO",{"$f":"E13","v":{"$error":"#DIV/0!"}}]
{"$rows_left_out":2}
{"sheet":"PI 6","index":5,"n_rows":12,"n_cols":10,"rows_kept":12,"cut":false,"hidden":true,"merged":[[11,1,11,2],[1,1,1,4],[2,1,2,4]]}
[]
[null,{"$f":"IF(OR('Introduccion de datos'!C18=6),\"PROGRAMA DE INCENTIVOS 6\",\"NO UTILIZAR ESTA HOJA PARA EL CÁLCULO\")","v":"NO UTILIZAR ESTA HOJA PARA EL CÁLCULO"}]
[null,"DATOS DE ENTRADA"]
[null,"¿Sector?",{"$f":"'Introduccion de datos'!C61","v":0},"Número de viviendas que utilizarán la instalación",{"$f":"'Introduccion de datos'!C68","v":0}]
[null,"Potencia instalación TÉRMICA (kW)",{"$f":"'Introduccion de datos'!C62","v":0},"Inversión en instalación TÉRMICA",{"$f":"'Introduccion de datos'!C63","v":0},null,"Mód. Adic.","Declarado","Máximo","Comentario"]
[null,"¿Se realiza Nueva Distribución Interior?",{"$f":"'Introduccion de datos'!C64","v":0},"Costes de la actuación NUEVA DISTR.",{"$f":"'Introduccion de datos'!C65","v":0},null,{"$f":"IF(C6=\"NO\",0,IF(AND(C6=\"Radiadores\",J6=\"SI\"),Auxiliar!K85,IF(J6=\"No aplica por tipo de instalación\",0,Auxiliar!K84)))","v":0},{"$f":"E6/C5","v":{"$error":"#DIV/0!"}},{"$f":"IF(C6=\"NO\",0,IF(AND(C6=\"Radiadores\",J6=\"SI\"),Auxiliar!L85,IF(J6=\"No aplica por tipo de instalación\",0,Auxiliar!L84)))","v":0},{"$f":"IF(OR('Introduccion de datos'!C13=Auxiliar!Z8,'Introduccion de datos'!C13=Auxiliar!Z9,'Introduccion de datos'!C13=Auxiliar!Z12,'Introduccion de datos'!C13=Auxiliar!Z13),\"SI\",\"No aplica por tipo de instalación\")","v":"No aplica por tipo de instalación"}]
[null,"¿Se Desmantela instalación existente?",{"$f":"'Introduccion de datos'!C66","v":0},"Costes de la actuación DESMANTELAMIENTO",{"$f":"'Introduccion de datos'!C67","v":0},null,{"$f":"IF(AND('Introduccion de datos'!C13=Auxiliar!Z9,C7=\"SI\"),Auxiliar!K86,IF(AND(C7=\"SI\",OR('Introduccion de datos'!C13=Auxiliar!Z10,'Introduccion de datos'!C13=Auxiliar!Z11)),Auxiliar!K87,0))","v":0},{"$f":"E7/C5","v":{"$error":"#DIV/0!"}},{"$f":"IF(AND('Introduccion de datos'!C13=Auxiliar!Z9,C7=\"SI\"),Auxiliar!L86,IF(AND(C7=\"SI\",OR('Introduccion de datos'!C13=Auxiliar!Z10,'Introduccion de datos'!C13=Auxiliar!Z11)),Auxiliar!L87,0))","v":0},{"$f":"IF(AND(G7=0,C7=\"SI\"),\"No aplica por tipo de instalación\",\"OK\")","v":"OK"}]
[null,null,null,"Coste elegible declarado instalación TÉRMICA",{"$f":"E5","v":0},null,"Módulo","Declarado","Máximo","Fila del tipo de actuación"]
[null,"Coste subvencionable unitario TÉRMICA (€/kW)",{"$f":"IF(J9=\"No aplica\",0,MIN(G9,H9))","v":0},"Coste subvencionable TÉRMICA",{"$f":"IF(J9=\"No aplica\",0,MIN(C9*C5,E4*I9))","v":0},null,{"$f":"IF(C4=\"Sector Residencial\",VLOOKUP(J9,Auxiliar!G64:L72,5,FALSE),VLOOKUP(J9,Auxiliar!G74:L82,5,FALSE))","v":{"$error":"#N/A"}},{"$f":"IF('Introduccion de datos'!C18=6,E8/C5,0)","v":0},{"$f":"IF(C4=\"Sector Residencial\",VLOOKUP(J9,Auxiliar!G64:L72,6,FALSE),VLOOKUP(J9,Auxiliar!G74:L82,6,FALSE))","v":{"$error":"#N/A"}},{"$f":"IF('Introduccion de datos'!C13=Auxiliar!Z8,\"F1\",IF('Introduccion de datos'!C13=Auxiliar!Z10,\"F6\",IF('Introduccion de datos'!C13=Auxiliar!Z11,\"F7\",IF('Introduccion de datos'!C13=Auxiliar!Z12,\"F8\",IF('Introduccion de datos'!C13=Auxiliar!Z13,\"F9\",IF(AND('Introduccion de datos'!C13=Auxiliar!Z9,C5>400),\"F2\",IF(AND('Introduccion de datos'!C13=Auxiliar!Z9,C5<=400,C5>100),\"F3\",IF(AND('Introduccion de datos'!C13=Auxiliar!Z9,C5<=100,C5>50),\"F4\",IF(AND('Introduccion de datos'!C13=Auxiliar!Z9,C5<=50),\"F5\",\"No aplica\")))))))))","v":"No aplica"}]
[null,"Coste subvencionable unitario NUEVA DISTR. (€/kW)",{"$f":"MIN(G6,H6)","v":{"$error":"#DIV/0!"}},"Coste subvencionable NUEVA DISTR.",{"$f":"MIN(C10*C5,I6)","v":{"$error":"#DIV/0!"}}]
[null,"Coste subvencionable unitario DESMANTELAMIENTO (€/kW)",{"$f":"MIN(G7,H7)","v":{"$error":"#DIV/0!"}},"Coste subvencionable DESMANTELAMIENTO",{"$f":"MIN(C11*C5,I7)","v":{"$error":"#DIV/0!"}}]
[null,"SUBVENCIÓN A CONCEDER",null,{"$f":"IF(C4=\"Otro sector (agropecuario, etc)\",\"No subvencionable\",SUM(E9:E11))","v":{"$error":"#DIV/0!"}},{"$f":"IF(C4=\"Otro sector (agropecuario, etc)\",\"No aplica\",D12/SUM(E5:E7))","v":{"$error":"#DIV/0!"}}]